JCDyer
10-11-2002, 05:38 PM
I was doing ok in till I got to the make command. I get the following error, after going so far into it:
Success!
Please run:
make
[root@localhost showeq]# make
make all-recursive
make[1]: Entering directory `/seq/showeq'
Making all in maps
make[2]: Entering directory `/seq/showeq/maps'
make[2]: Nothing to be done for `all'.
make[2]: Leaving directory `/seq/showeq/maps'
Making all in src
make[2]: Entering directory `/seq/showeq/src'
g++ -DHAVE_CONFIG_H -I. -I. -I.. -I/usr/lib/qt3/include -I/usr/X11R6/include -DMAPDIR=\"/usr/local/share/showeq\" -DLOGDIR=\"/usr/local/share/showeq\" -I/usr/include/pcap -D_REENTRANT -O2 -Wall -g -ggdb -DDEBUG -finline-functions -DQT_THREAD_SUPPORT=1 -DDISPLAY_ICONS=false -DICON_DIR=\"/eq-icons/\" -c main.cpp
g++ -DHAVE_CONFIG_H -I. -I. -I.. -I/usr/lib/qt3/include -I/usr/X11R6/include -DMAPDIR=\"/usr/local/share/showeq\" -DLOGDIR=\"/usr/local/share/showeq\" -I/usr/include/pcap -D_REENTRANT -O2 -Wall -g -ggdb -DDEBUG -finline-functions -DQT_THREAD_SUPPORT=1 -DDISPLAY_ICONS=false -DICON_DIR=\"/eq-icons/\" -c spawn.cpp
g++ -DHAVE_CONFIG_H -I. -I. -I.. -I/usr/lib/qt3/include -I/usr/X11R6/include -DMAPDIR=\"/usr/local/share/showeq\" -DLOGDIR=\"/usr/local/share/showeq\" -I/usr/include/pcap -D_REENTRANT -O2 -Wall -g -ggdb -DDEBUG -finline-functions -DQT_THREAD_SUPPORT=1 -DDISPLAY_ICONS=false -DICON_DIR=\"/eq-icons/\" -c spawnshell.cpp
spawnshell.cpp: In member function `void SpawnShell::consMessage(const considerStruct*, unsigned int, unsigned char)':
spawnshell.cpp:831: internal error: Segmentation fault
Please submit a full bug report,
with preprocessed source if appropriate.
See <URL:https://qa.mandrakesoft.com/> for instructions.
make[2]: *** [spawnshell.o] Error 1
make[2]: Leaving directory `/seq/showeq/src'
make[1]: *** [all-recursive] Error 1
make[1]: Leaving directory `/seq/showeq'
make: *** [all-recursive-am] Error 2
[root@localhost showeq]#
I think the is probably why I got the error in the make install command, I never noticed the error in here first. So anyone have any ideas on the cause of this problem? I read something about memory in another post... I have 64mb, and my swap is a little over 100mb... Should I try increasing my swap? I don't think I can put much more ram than 64... Or is this not even the problem? Thanks for any help.
JCD
Success!
Please run:
make
[root@localhost showeq]# make
make all-recursive
make[1]: Entering directory `/seq/showeq'
Making all in maps
make[2]: Entering directory `/seq/showeq/maps'
make[2]: Nothing to be done for `all'.
make[2]: Leaving directory `/seq/showeq/maps'
Making all in src
make[2]: Entering directory `/seq/showeq/src'
g++ -DHAVE_CONFIG_H -I. -I. -I.. -I/usr/lib/qt3/include -I/usr/X11R6/include -DMAPDIR=\"/usr/local/share/showeq\" -DLOGDIR=\"/usr/local/share/showeq\" -I/usr/include/pcap -D_REENTRANT -O2 -Wall -g -ggdb -DDEBUG -finline-functions -DQT_THREAD_SUPPORT=1 -DDISPLAY_ICONS=false -DICON_DIR=\"/eq-icons/\" -c main.cpp
g++ -DHAVE_CONFIG_H -I. -I. -I.. -I/usr/lib/qt3/include -I/usr/X11R6/include -DMAPDIR=\"/usr/local/share/showeq\" -DLOGDIR=\"/usr/local/share/showeq\" -I/usr/include/pcap -D_REENTRANT -O2 -Wall -g -ggdb -DDEBUG -finline-functions -DQT_THREAD_SUPPORT=1 -DDISPLAY_ICONS=false -DICON_DIR=\"/eq-icons/\" -c spawn.cpp
g++ -DHAVE_CONFIG_H -I. -I. -I.. -I/usr/lib/qt3/include -I/usr/X11R6/include -DMAPDIR=\"/usr/local/share/showeq\" -DLOGDIR=\"/usr/local/share/showeq\" -I/usr/include/pcap -D_REENTRANT -O2 -Wall -g -ggdb -DDEBUG -finline-functions -DQT_THREAD_SUPPORT=1 -DDISPLAY_ICONS=false -DICON_DIR=\"/eq-icons/\" -c spawnshell.cpp
spawnshell.cpp: In member function `void SpawnShell::consMessage(const considerStruct*, unsigned int, unsigned char)':
spawnshell.cpp:831: internal error: Segmentation fault
Please submit a full bug report,
with preprocessed source if appropriate.
See <URL:https://qa.mandrakesoft.com/> for instructions.
make[2]: *** [spawnshell.o] Error 1
make[2]: Leaving directory `/seq/showeq/src'
make[1]: *** [all-recursive] Error 1
make[1]: Leaving directory `/seq/showeq'
make: *** [all-recursive-am] Error 2
[root@localhost showeq]#
I think the is probably why I got the error in the make install command, I never noticed the error in here first. So anyone have any ideas on the cause of this problem? I read something about memory in another post... I have 64mb, and my swap is a little over 100mb... Should I try increasing my swap? I don't think I can put much more ram than 64... Or is this not even the problem? Thanks for any help.
JCD